Reaction Details
TargetFurin
LigandBDBM50303788
Substrate/Competitorn/a
Meas. Tech.ChEMBL_597562 (CHEMBL1049699)
Ki 1430±n/a nM
Citation Becker, GLSielaff, FThan, MELindberg, IRouthier, SDay, RLu, YGarten, WSteinmetzer, T Potent inhibitors of furin and furin-like proprotein convertases containing decarboxylated P1 arginine mimetics. J Med Chem53:1067-75 (2010) 
 
Furin
Name:Furin
Type:Enzyme Catalytic Domain
Mol. Mass.:86676.01
Organism:Homo sapiens (Human)
Description:P09958
Residue:794
BDBM50303788
NameBDBM50303788
Synonyms:(S)-5-guanidino-N-((S)-1-((S)-5-guanidino-1-(4-(guanidinomethyl)benzylamino)-1-oxopentan-2-ylamino)-3-methyl-1-oxobutan-2-yl)-2-(2-phenylacetamido)pentanamide | CHEMBL567670
TypeSmall organic molecule
Emp. Form.C34H53N13O4
Mol. Mass.707.8693
SMILES[#6]-[#6](-[#6])-[#6@H](-[#7]-[#6](=O)-[#6@H](-[#6]-[#6]-[#6]\[#7]=[#6](/[#7])-[#7])-[#7]-[#6](=O)-[#6]-c1ccccc1)-[#6](=O)-[#7]-[#6@@H](-[#6]-[#6]-[#6]\[#7]=[#6](/[#7])-[#7])-[#6](=O)-[#7]-[#6]-c1ccc(-[#6]\[#7]=[#6](\[#7])-[#7])cc1