Reaction Details
TargetLow affinity immunoglobulin gamma Fc region receptor II-a
LigandBDBM50303805
Substrate/Competitorn/a
Meas. Tech.ChEMBL_594758 (CHEMBL1039868)
IC50 12000±n/a nM
Citation Zacharie, BAbbott, SDBienvenu, JFCameron, ADCloutier, JDuceppe, JSEzzitouni, AFortin, DHoude, KLauzon, CMoreau, NPerron, VWilb, NAsselin, MDoucet, AFafard, MEGaudreau, DGrouix, BSarra-Bournet, FSt-Amant, NGagnon, LPenney, CL 2,4,6-trisubstituted triazines as protein a mimetics for the treatment of autoimmune diseases. J Med Chem53:1138-45 (2010) 
 
Low affinity immunoglobulin gamma Fc region receptor II-a
Name:Low affinity immunoglobulin gamma Fc region receptor II-a
Type:PROTEIN
Mol. Mass.:35001.29
Organism:Homo sapiens (Human)
Description:ChEMBL_594758
Residue:317
BDBM50303805
NameBDBM50303805
Synonyms:2-(4-(4-(4-(4-aminophenethylamino)-6-(3-aminophenylamino)-1,3,5-triazin-2-ylamino)phenethylamino)-6-(3-aminophenylamino)-1,3,5-triazin-2-ylamino)ethanol | CHEMBL570394
TypeSmall organic molecule
Emp. Form.C36H41N15O
Mol. Mass.699.8106
SMILESNc1ccc(CCNc2nc(Nc3ccc(CCNc4nc(NCCO)nc(Nc5cccc(N)c5)n4)cc3)nc(Nc3cccc(N)c3)n2)cc1