Reaction Details
TargetCannabinoid receptor 2
LigandBDBM50303837
Substrate/Competitorn/a
Meas. Tech.ChEMBL_594921 (CHEMBL1041654)
Ki>1000±n/a nM
Citation Lange, JHCoolen, HKvan der Neut, MABorst, AJStork, BVerveer, PCKruse, CG Design, synthesis, biological properties, and molecular modeling investigations of novel tacrine derivatives with a combination of acetylcholinesterase inhibition and cannabinoid CB1 receptor antagonism. J Med Chem53:1338-46 (2010) 
 
Cannabinoid receptor 2
Name:Cannabinoid receptor 2
Type:G Protein-Coupled Receptor (GPCR)
Mol. Mass.:39690.94
Organism:Homo sapiens (Human)
Description:P34972
Residue:360
BDBM50303837
NameBDBM50303837
Synonyms:CHEMBL570623 | [3-(4-Chlorophenyl)-4-phenyl-4,5-dihydro-1H-pyrazol-1-yl]-{[2-(dimethylamino)ethylpiperazin-4-yl]methylene}-4-chlorobenzenesulfonamide
TypeSmall organic molecule
Emp. Form.C30H34Cl2N6O2S
Mol. Mass.613.601
SMILESCN(C)CCN1CCN(CC1)C(=NS(=O)(=O)c1ccc(Cl)cc1)N1CC(C(=N1)c1ccc(Cl)cc1)c1ccccc1