Reaction Details
TargetCannabinoid receptor 2
LigandBDBM50303842
Substrate/Competitorn/a
Meas. Tech.ChEMBL_594921 (CHEMBL1041654)
Ki>1000±n/a nM
Citation Lange, JHCoolen, HKvan der Neut, MABorst, AJStork, BVerveer, PCKruse, CG Design, synthesis, biological properties, and molecular modeling investigations of novel tacrine derivatives with a combination of acetylcholinesterase inhibition and cannabinoid CB1 receptor antagonism. J Med Chem53:1338-46 (2010) 
 
Cannabinoid receptor 2
Name:Cannabinoid receptor 2
Type:G Protein-Coupled Receptor (GPCR)
Mol. Mass.:39690.94
Organism:Homo sapiens (Human)
Description:P34972
Residue:360
BDBM50303842
NameBDBM50303842
Synonyms:CHEMBL567532 | N-[7-(1,2,3,4-Tetrahydroacridin-9-ylamino)heptyl]-2-(2-chlorophenyl)-1-(4-chlorophenyl)-5-ethyl-1H-imidazole-4-carboxamide
TypeSmall organic molecule
Emp. Form.C38H41Cl2N5O
Mol. Mass.654.671
SMILESCCc1c(nc(-c2ccccc2Cl)n1-c1ccc(Cl)cc1)C(=O)NCCCCCCCNc1c2CCCCc2nc2ccccc12