Reaction Details
TargetCannabinoid receptor 1
LigandBDBM50303843
Substrate/Competitorn/a
Meas. Tech.ChEMBL_594927 (CHEMBL1041660)
Ki 701±n/a nM
Citation Lange, JHCoolen, HKvan der Neut, MABorst, AJStork, BVerveer, PCKruse, CG Design, synthesis, biological properties, and molecular modeling investigations of novel tacrine derivatives with a combination of acetylcholinesterase inhibition and cannabinoid CB1 receptor antagonism. J Med Chem53:1338-46 (2010) 
 
Cannabinoid receptor 1
Name:Cannabinoid receptor 1
Type:G Protein-Coupled Receptor (GPCR)
Mol. Mass.:52868.96
Organism:Homo sapiens (Human)
Description:P21554
Residue:472
BDBM50303843
NameBDBM50303843
Synonyms:5-(4-chlorophenyl)-1-(2,4-dichlorophenyl)-4-methyl-N-(7-(N-(1-phenethylpiperidin-4-yl)propionamido)heptyl)-1H-pyrazole-3-carboxamide | CHEMBL570516
TypeSmall organic molecule
Emp. Form.C40H48Cl3N5O2
Mol. Mass.737.2
SMILESCCC(=O)N(CCCCCCCNC(=O)c1nn(c(c1C)-c1ccc(Cl)cc1)-c1ccc(Cl)cc1Cl)C1CCN(CCc2ccccc2)CC1