Reaction Details
TargetCannabinoid receptor 2
LigandBDBM50303846
Substrate/Competitorn/a
Meas. Tech.ChEMBL_594921 (CHEMBL1041654)
Ki 571±n/a nM
Citation Lange, JHCoolen, HKvan der Neut, MABorst, AJStork, BVerveer, PCKruse, CG Design, synthesis, biological properties, and molecular modeling investigations of novel tacrine derivatives with a combination of acetylcholinesterase inhibition and cannabinoid CB1 receptor antagonism. J Med Chem53:1338-46 (2010) 
 
Cannabinoid receptor 2
Name:Cannabinoid receptor 2
Type:G Protein-Coupled Receptor (GPCR)
Mol. Mass.:39690.94
Organism:Homo sapiens (Human)
Description:P34972
Residue:360
BDBM50303846
NameBDBM50303846
Synonyms:CHEMBL585736 | [3-(4-Chlorophenyl)-4-phenyl-4,5-dihydro-1H-pyrazol-1-yl]-[4-(1,1-dioxothiomorpholinyl)methylene]-4-chlorobenzenesulfonamide
TypeSmall organic molecule
Emp. Form.C26H24Cl2N4O4S2
Mol. Mass.591.529
SMILESClc1ccc(cc1)C1=NN(CC1c1ccccc1)C(=NS(=O)(=O)c1ccc(Cl)cc1)N1CCS(=O)(=O)CC1