Reaction Details
TargetDelta-type opioid receptor
LigandBDBM50303849
Substrate/Competitorn/a
Meas. Tech.ChEMBL_594976 (CHEMBL1038967)
Ki>10000±n/a nM
Citation Hsin, LWChang, LTRothman, RBDersch, CMFishback, JAMatsumoto, RR Synthesis and opioid activity of enantiomeric N-substituted 2,3,4,4a,5,6,7,7a-octahydro-1H-benzofuro[3,2-e]isoquinolines. J Med Chem53:1392-6 (2010) 
 
Delta-type opioid receptor
Name:Delta-type opioid receptor
Type:G Protein-Coupled Receptor (GPCR)
Mol. Mass.:40382.98
Organism:Homo sapiens (Human)
Description:Competition binding assays were carried out using membrane preparations from transfected HN9.10 cells that constitutively expressed the delta opioid receptor.
Residue:372
BDBM50303849
NameBDBM50303849
Synonyms:(+)-cis-9-Methoxy-3-methyl-2,3,4,4aalpha,5,6,7,7aalpha-octahydro-1H-benzo[4,5]furo[3,2-e]isoquinoline CHEMBL584725
TypeSmall organic molecule
Emp. Form.C16H21NO2
Mol. Mass.259.3434
SMILESCN1CC[C@]23[C@H](CCC[C@@H]2C1)Oc1c3cccc1O