Reaction Details
TargetKappa-type opioid receptor
LigandBDBM50303847
Substrate/Competitorn/a
Meas. Tech.ChEMBL_594974 (CHEMBL1038965)
Ki 3470±n/a nM
Citation Hsin, LWChang, LTRothman, RBDersch, CMFishback, JAMatsumoto, RR Synthesis and opioid activity of enantiomeric N-substituted 2,3,4,4a,5,6,7,7a-octahydro-1H-benzofuro[3,2-e]isoquinolines. J Med Chem53:1392-6 (2010) 
 
Kappa-type opioid receptor
Name:Kappa-type opioid receptor
Type:G Protein-Coupled Receptor (GPCR)
Mol. Mass.:42648.76
Organism:Homo sapiens (Human)
Description:P41145
Residue:380
BDBM50303847
NameBDBM50303847
Synonyms:(+)-trans-9-Methoxy-3-methyl-2,3,4,4aalpha,5,6,7,7aalpha-octahydro-1H-benzo[4,5]furo[3,2-e]isoquinoline CHEMBL571610
TypeSmall organic molecule
Emp. Form.C17H23NO2
Mol. Mass.273.37
SMILESCOc1cccc2c1O[C@H]1CCC[C@H]3CN(C)CC[C@]213