Reaction Details
TargetAdenosine deaminase
LigandBDBM50303854
Substrate/Competitorn/a
Meas. Tech.ChEMBL_595163 (CHEMBL1037328)
IC50>100000±n/a nM
Citation Dang, QKasibhatla, SRXiao, WLiu, YDare, JTaplin, FReddy, KRScarlato, GRGibson, Tvan Poelje, PDPotter, SCErion, MD Fructose-1,6-bisphosphatase Inhibitors. 2. Design, synthesis, and structure-activity relationship of a series of phosphonic acid containing benzimidazoles that function as 5'-adenosinemonophosphate (AMP) mimics. J Med Chem53:441-51 (2010) 
 
Adenosine deaminase
Name:Adenosine deaminase
Type:Enzyme
Mol. Mass.:40759.44
Organism:Homo sapiens (Human)
Description:Human recombinant ADA was expressed and purified from an ADA-deficient bacterial strain.
Residue:363
BDBM50303854
NameBDBM50303854
Synonyms:5-(4-amino-7-ethyl-5-fluoro-1-isobutyl-1H-benzo[d]imidazol-2-yl)furan-2-ylphosphonic acid | CHEMBL570790
TypeSmall organic molecule
Emp. Form.C17H21FN3O4P
Mol. Mass.381.3385
SMILESCCc1cc(F)c(N)c2nc(-c3ccc(o3)P(O)(O)=O)n(CC(C)C)c12