Reaction Details
TargetDNA-(apurinic or apyrimidinic site) endonuclease
LigandBDBM50303955
Substrate/Competitorn/a
Meas. Tech.ChEMBL_595225 (CHEMBL1043577)
IC50 10000±n/a nM
Citation Nyland, RLLuo, MKelley, MRBorch, RF Design and synthesis of novel quinone inhibitors targeted to the redox function of apurinic/apyrimidinic endonuclease 1/redox enhancing factor-1 (Ape1/ref-1). J Med Chem53:1200-10 (2010) 
 
DNA-(apurinic or apyrimidinic site) endonuclease
Name:DNA-(apurinic or apyrimidinic site) endonuclease
Type:Protein
Mol. Mass.:35560.12
Organism:Homo sapiens (Human)
Description:P27695
Residue:318
BDBM50303955
NameBDBM50303955
Synonyms:(E)-3-(5,6-Dimethoxy-3-methyl-14-dioxocyclohexa-25-dienyl)-2-nonylpropenoic Acid E3330 | US9624235, Compound E3330
TypeSmall organic molecule
Emp. Form.C21H30O6
Mol. Mass.378.4593
SMILESCCCCCCCCCC(=CC1=C(C)C(=O)C(OC)=C(OC)C1=O)C(O)=O