Reaction Details
TargetP2Y purinoceptor 2
LigandBDBM50209659
Substrate/Competitorn/a
Meas. Tech.ChEMBL_601359 (CHEMBL1045996)
EC50 10000±n/a nM
Citation Ko, HDas, ACarter, RLFricks, IPZhou, YIvanov, AAMelman, AJoshi, BVKovác, PHajduch, JKirk, KLHarden, TKJacobson, KA Molecular recognition in the P2Y(14) receptor: Probing the structurally permissive terminal sugar moiety of uridine-5'-diphosphoglucose. Bioorg Med Chem17:5298-311 (2009) 
 
P2Y purinoceptor 2
Name:P2Y purinoceptor 2
Type:PROTEIN
Mol. Mass.:42299.21
Organism:Homo sapiens (Human)
Description:ChEMBL_1455361
Residue:377
BDBM50209659
NameBDBM50209659
Synonyms:UDP-alpha-D-glucose | uridine 5'-[3-alpha-D-glucopyranosyl dihydrogen diphosphate]
TypeSmall organic molecule
Emp. Form.C15H24N2O17P2
Mol. Mass.566.3018
SMILESOC[C@H]1O[C@H](OP(O)(=O)OP(O)(=O)OC[C@H]2O[C@H]([C@H](O)[C@@H]2O)n2ccc(=O)[nH]c2=O)[C@H](O)[C@@H](O)[C@@H]1O