Reaction Details
TargetSodium-dependent serotonin transporter
LigandBDBM50304053
Substrate/Competitorn/a
Meas. Tech.ChEMBL_601510 (CHEMBL1044205)
Ki 0.58±n/a nM
Citation Nielsen, SPedersen, CMHansen, SGPetersen, MDSinning, SWiborg, OJensen, HHBols, M An extended study of dimeric phenyl tropanes. Bioorg Med Chem17:4900-9 (2009) 
 
Sodium-dependent serotonin transporter
Name:Sodium-dependent serotonin transporter
Type:Multi-pass membrane protein
Mol. Mass.:70322.51
Organism:Homo sapiens (Human)
Description:P31645
Residue:630
BDBM50304053
NameBDBM50304053
Synonyms:CHEMBL595677 | methyl 8-methyl-3-(4-(thiophen-3-yl)phenyl)-8-azabicyclo[3.2.1]octane-2-carboxylate
TypeSmall organic molecule
Emp. Form.C20H23NO2S
Mol. Mass.341.467
SMILESCOC(=O)[C@@H]1C2CCC(C[C@@H]1c1ccc(cc1)-c1ccsc1)N2C