Reaction Details
TargetSodium-dependent dopamine transporter
LigandBDBM50304049
Substrate/Competitorn/a
Meas. Tech.ChEMBL_601509 (CHEMBL1044204)
Ki 1±n/a nM
Citation Nielsen, SPedersen, CMHansen, SGPetersen, MDSinning, SWiborg, OJensen, HHBols, M An extended study of dimeric phenyl tropanes. Bioorg Med Chem17:4900-9 (2009) 
 
Sodium-dependent dopamine transporter
Name:Sodium-dependent dopamine transporter
Type:Multi-pass membrane protein
Mol. Mass.:68497.11
Organism:Homo sapiens (Human)
Description:Q01959
Residue:620
BDBM50304049
NameBDBM50304049
Synonyms:1-[3beta-(4-Chloro-phenyl)tropane-2beta-carbonyl-oxy]-6-[4-(3beta-{4-chloro-phenyl}tropane-2beta-carbonyl-oxy-methyl)-(1,2,3)triazol-1-yl]hexane | CHEMBL596001
TypeSmall organic molecule
Emp. Form.C39H49Cl2N5O4
Mol. Mass.722.743
SMILESCN1C2CCC1[C@@H]([C@H](C2)c1ccc(Cl)cc1)C(=O)OCCCCCCn1cc(COC(=O)[C@@H]2C3CCC(C[C@@H]2c2ccc(Cl)cc2)N3C)nn1