Reaction Details
TargetKappa-type opioid receptor
LigandBDBM50000296
Substrate/Competitorn/a
Meas. Tech.ChEMBL_601579 (CHEMBL1047759)
IC50 1.99±n/a nM
Citation Deb, IPaira, PHazra, ABanerjee, SDutta, PKMondal, NBDas, S Synthesis and characterizations of novel quinoline derivatives having mixed ligand activities at the kappa and mu receptors: Potential therapeutic efficacy against morphine dependence. Bioorg Med Chem17:5782-90 (2009) 
 
Kappa-type opioid receptor
Name:Kappa-type opioid receptor
Type:G Protein-Coupled Receptor (GPCR)
Mol. Mass.:42648.76
Organism:Homo sapiens (Human)
Description:P41145
Residue:380
BDBM50000296
NameBDBM50000296
Synonyms:CHEMBL441765 U-50488H | US11492374, ID 1
TypeSmall organic molecule
Emp. Form.C19H26Cl2N2O
Mol. Mass.369.329
SMILESCN([C@@H]1CCCC[C@H]1N1CCCC1)C(=O)Cc1ccc(Cl)c(Cl)c1