Reaction Details
TargetMu-type opioid receptor
LigandBDBM50190362
Substrate/Competitorn/a
Meas. Tech.ChEMBL_601678 (CHEMBL1049576)
Ki>10000±n/a nM
Citation Peng, YZhang, QArora, SKeenan, SMKortagere, SWannemacher, KMHowells, RDWelsh, WJ Novel delta opioid receptor agonists exhibit differential stimulation of signaling pathways. Bioorg Med Chem17:6442-50 (2009) 
 
Mu-type opioid receptor
Name:Mu-type opioid receptor
Type:Enzyme Catalytic Domain
Mol. Mass.:44431.62
Organism:MOUSE
Description:OPIATE Mu OPRM1 MOUSE::P42866
Residue:398
BDBM50190362
NameBDBM50190362
Synonyms:1-{3-[4-(tert-butyl) phenyl]-5-N,N-dimethylaminomethyl-(1,2,4-triazol-4-yl)}-3-phenol CHEMBL212375
TypeSmall organic molecule
Emp. Form.C21H26N4O
Mol. Mass.350.4573
SMILESCN(C)Cc1nnc(-c2ccc(cc2)C(C)(C)C)n1-c1cccc(O)c1