Reaction Details
TargetKappa-type opioid receptor
LigandBDBM50304080
Substrate/Competitorn/a
Meas. Tech.ChEMBL_601679 (CHEMBL1049577)
IC50>10000±n/a nM
Citation Peng, YZhang, QArora, SKeenan, SMKortagere, SWannemacher, KMHowells, RDWelsh, WJ Novel delta opioid receptor agonists exhibit differential stimulation of signaling pathways. Bioorg Med Chem17:6442-50 (2009) 
 
Kappa-type opioid receptor
Name:Kappa-type opioid receptor
Type:G Protein-Coupled Receptor (GPCR)
Mol. Mass.:42692.90
Organism:Rattus norvegicus (rat)
Description:P34975
Residue:380
BDBM50304080
NameBDBM50304080
Synonyms:(5-(4-tert-Butylphenyl)-1-(3-methoxyphenyl)-1H-1,2,4-triazol-3-yl)-N,N-dimethylmethanamine | CHEMBL595448
TypeSmall organic molecule
Emp. Form.C22H28N4O
Mol. Mass.364.4839
SMILESCOc1cccc(c1)-n1nc(CN(C)C)nc1-c1ccc(cc1)C(C)(C)C