Reaction Details
TargetDelta-type opioid receptor
LigandBDBM50190362
Substrate/Competitorn/a
Meas. Tech.ChEMBL_601677 (CHEMBL1049575)
Ki 460±n/a nM
Citation Peng, YZhang, QArora, SKeenan, SMKortagere, SWannemacher, KMHowells, RDWelsh, WJ Novel delta opioid receptor agonists exhibit differential stimulation of signaling pathways. Bioorg Med Chem17:6442-50 (2009) 
 
Delta-type opioid receptor
Name:Delta-type opioid receptor
Type:Enzyme Catalytic Domain
Mol. Mass.:40577.25
Organism:MOUSE
Description:P32300
Residue:372
BDBM50190362
NameBDBM50190362
Synonyms:1-{3-[4-(tert-butyl) phenyl]-5-N,N-dimethylaminomethyl-(1,2,4-triazol-4-yl)}-3-phenol CHEMBL212375
TypeSmall organic molecule
Emp. Form.C21H26N4O
Mol. Mass.350.4573
SMILESCN(C)Cc1nnc(-c2ccc(cc2)C(C)(C)C)n1-c1cccc(O)c1