Reaction Details
TargetKappa-type opioid receptor
LigandBDBM50304083
Substrate/Competitorn/a
Meas. Tech.ChEMBL_601679 (CHEMBL1049577)
IC50 351±n/a nM
Citation Peng, YZhang, QArora, SKeenan, SMKortagere, SWannemacher, KMHowells, RDWelsh, WJ Novel delta opioid receptor agonists exhibit differential stimulation of signaling pathways. Bioorg Med Chem17:6442-50 (2009) 
 
Kappa-type opioid receptor
Name:Kappa-type opioid receptor
Type:G Protein-Coupled Receptor (GPCR)
Mol. Mass.:42692.90
Organism:Rattus norvegicus (rat)
Description:P34975
Residue:380
BDBM50304083
NameBDBM50304083
Synonyms:3-(3-((Dimethylamino)methyl)-5-(2,4-dimethylphenyl)-1H-1,2,4-triazol-1-yl)phenol | CHEMBL596371
TypeSmall organic molecule
Emp. Form.C19H22N4O
Mol. Mass.322.4042
SMILESCN(C)Cc1nc(-c2ccc(C)cc2C)n(n1)-c1cccc(O)c1