Reaction Details
TargetGlutamate receptor ionotropic, NMDA 2B
LigandBDBM50304085
Substrate/Competitorn/a
Meas. Tech.ChEMBL_601749 (CHEMBL1047804)
Ki 119±n/a nM
Citation Mosley, CAMyers, SJMurray, EESantangelo, RTahirovic, YAKurtkaya, NMullasseril, PYuan, HLyuboslavsky, PLe, PWilson, LJYepes, MDingledine, RTraynelis, SFLiotta, DC Synthesis, structural activity-relationships, and biological evaluation of novel amide-based allosteric binding site antagonists in NR1A/NR2B N-methyl-D-aspartate receptors. Bioorg Med Chem17:6463-80 (2009) 
 
Glutamate receptor ionotropic, NMDA 2B
Name:Glutamate receptor ionotropic, NMDA 2B
Type:Protein
Mol. Mass.:166077.66
Organism:Rattus norvegicus (Rat)
Description:Q00960
Residue:1482
BDBM50304085
NameBDBM50304085
Synonyms:CHEMBL607819 | N-(2-(3,4-Dichlorophenylamino)ethyl)-2-(4-(methylsulfonamido)phenoxy)acetamide
TypeSmall organic molecule
Emp. Form.C17H19Cl2N3O4S
Mol. Mass.432.321
SMILESCS(=O)(=O)Nc1ccc(OCC(=O)NCCNc2ccc(Cl)c(Cl)c2)cc1