Reaction Details
TargetCyclin-dependent kinase 5 activator 1
LigandBDBM50304109
Substrate/Competitorn/a
Meas. Tech.ChEMBL_602176 (CHEMBL1044713)
IC50 6.0±n/a nM
Citation Beauchard, ALaborie, HRouillard, HLozach, OFerandin, YLe Guével, RGuguen-Guillouzo, CMeijer, LBesson, TThiéry, V Synthesis and kinase inhibitory activity of novel substituted indigoids. Bioorg Med Chem17:6257-63 (2009) 
 
Cyclin-dependent kinase 5 activator 1
Name:Cyclin-dependent kinase 5 activator 1
Type:Protein Complex
Mol. Mass.:n/a
Description:n/a
Components:This complex has 2 components.
Component 1
Name:Cyclin-dependent kinase 5
Synonyms:CDK5 CDKN5 Cyclin-dependent kinase 5 (CDK5/ p25) Cyclin-dependent-like kinase 5 PSSALRE Tau protein kinase II catalytic subunit
Type:Enzyme Subunit
Mol. Mass.:33308.61
Organism:Homo sapiens (Human)
Description:n/a
Residue:292
Component 2
Name:Cyclin-dependent kinase 5 activator 1
Synonyms:CD5R1_HUMAN CDK5R1 Cyclin-dependent kinase 5 (CDK5/p25) NCK5A p35
Type:Enzyme Subunit
Mol. Mass.:34077.43
Organism:Homo sapiens (Human)
Description:Q15078
Residue:307
BDBM50304109
NameBDBM50304109
Synonyms:(Z)-5'-Nitro-1H,1'H-[2,3']biindolylidene-3,2'-dione 3-oxime CHEMBL471250
TypeSmall organic molecule
Emp. Form.C16H10N4O4
Mol. Mass.322.275
SMILES[O-][N+](=O)c1ccc2NC(=O)C(c2c1)c1[nH]c2ccccc2c1N=O