Reaction Details
TargetHypoxanthine-guanine phosphoribosyltransferase
LigandBDBM50304140
Substrate/Competitorn/a
Meas. Tech.ChEMBL_602349 (CHEMBL1041579)
Ki 100±n/a nM
Citation Hocková, DHolý, AMasojídková, MKeough, DTde Jersey, JGuddat, LW Synthesis of branched 9-[2-(2-phosphonoethoxy)ethyl]purines as a new class of acyclic nucleoside phosphonates which inhibit Plasmodium falciparum hypoxanthine-guanine-xanthine phosphoribosyltransferase. Bioorg Med Chem17:6218-32 (2009) 
 
Hypoxanthine-guanine phosphoribosyltransferase
Name:Hypoxanthine-guanine phosphoribosyltransferase
Type:Protein
Mol. Mass.:24579.61
Organism:Homo sapiens (Human)
Description:P00492
Residue:218
BDBM50304140
NameBDBM50304140
Synonyms:9-[2-(1-Phosphonopropan-2-yloxy)ethyl]guanine | CHEMBL594335
TypeSmall organic molecule
Emp. Form.C10H16N5O5P
Mol. Mass.317.2383
SMILESCC(CP(O)(O)=O)OCCn1cnc2c1nc(N)[nH]c2=O