Reaction Details
TargetNitric oxide synthase, brain
LigandBDBM50209236
Substrate/Competitorn/a
Meas. Tech.ChEMBL_600962 (CHEMBL1046067)
IC50 22000±n/a nM
Citation Claramunt, RMLópez, CPérez-Medina, CPérez-Torralba, MElguero, JEscames, GAcuña-Castroviejo, D Fluorinated indazoles as novel selective inhibitors of nitric oxide synthase (NOS): synthesis and biological evaluation. Bioorg Med Chem17:6180-7 (2009) 
 
Nitric oxide synthase, brain
Name:Nitric oxide synthase, brain
Type:Homodimer
Mol. Mass.:160985.98
Organism:Homo sapiens (Human)
Description:P29475
Residue:1434
BDBM50209236
NameBDBM50209236
Synonyms:6-Chloro-1H-indazole | CHEMBL392184
TypeSmall organic molecule
Emp. Form.C7H5ClN2
Mol. Mass.152.581
SMILESClc1ccc2cn[nH]c2c1