Reaction Details
TargetNitric oxide synthase, brain
LigandBDBM24627
Substrate/Competitorn/a
Meas. Tech.ChEMBL_600964 (CHEMBL1046069)
IC50 178000±n/a nM
Citation Claramunt, RMLópez, CPérez-Medina, CPérez-Torralba, MElguero, JEscames, GAcuña-Castroviejo, D Fluorinated indazoles as novel selective inhibitors of nitric oxide synthase (NOS): synthesis and biological evaluation. Bioorg Med Chem17:6180-7 (2009) 
 
Nitric oxide synthase, brain
Name:Nitric oxide synthase, brain
Type:Homodimer
Mol. Mass.:160985.98
Organism:Homo sapiens (Human)
Description:P29475
Residue:1434
BDBM24627
NameBDBM24627
Synonyms:1H-indazole Indazole, 6
TypeSmall organic molecule
Emp. Form.C7H6N2
Mol. Mass.118.1359
SMILESc1n[nH]c2ccccc12