Reaction Details
TargetNitric oxide synthase, inducible
LigandBDBM50270528
Substrate/Competitorn/a
Meas. Tech.ChEMBL_600963 (CHEMBL1046068)
IC50 290±n/a nM
Citation Claramunt, RMLópez, CPérez-Medina, CPérez-Torralba, MElguero, JEscames, GAcuña-Castroviejo, D Fluorinated indazoles as novel selective inhibitors of nitric oxide synthase (NOS): synthesis and biological evaluation. Bioorg Med Chem17:6180-7 (2009) 
 
Nitric oxide synthase, inducible
Name:Nitric oxide synthase, inducible
Type:Homodimer
Mol. Mass.:131141.95
Organism:Homo sapiens (Human)
Description:P35228
Residue:1153
BDBM50270528
NameBDBM50270528
Synonyms:3-BROMO-7-NITROINDAZOLE CHEMBL479014
TypeSmall organic molecule
Emp. Form.C7H4BrN3O2
Mol. Mass.242.03
SMILES[O-][N+](=O)c1cccc2c(Br)n[nH]c12