Reaction Details
TargetAmine oxidase [flavin-containing] A
LigandBDBM50304159
Substrate/Competitorn/a
Meas. Tech.ChEMBL_601025 (CHEMBL1069162)
IC50 3010±n/a nM
Citation Gökhan-Kelekçi, NSimsek, OOErcan, AYelekçi, KSahin, ZSIsik, SUçar, GBilgin, AA Synthesis and molecular modeling of some novel hexahydroindazole derivatives as potent monoamine oxidase inhibitors. Bioorg Med Chem17:6761-72 (2009) 
 
Amine oxidase [flavin-containing] A
Name:Amine oxidase [flavin-containing] A
Type:Enzyme
Mol. Mass.:59515.21
Organism:Rattus norvegicus (rat)
Description:n/a
Residue:526
BDBM50304159
NameBDBM50304159
Synonyms:3-(2-Thienyl)-2-(N-ethylthiocarbamoyl)-3,3a,4,5,6,7-hexahydro-2H-indazol | CHEMBL596340
TypeSmall organic molecule
Emp. Form.C14H19N3S2
Mol. Mass.293.451
SMILESCCNC(=S)N1N=C2CCCCC2C1c1cccs1