Reaction Details
TargetAmine oxidase [flavin-containing] A
LigandBDBM50304152
Substrate/Competitorn/a
Meas. Tech.ChEMBL_601025 (CHEMBL1069162)
Ki 3900±n/a nM
Citation Gökhan-Kelekçi, NSimsek, OOErcan, AYelekçi, KSahin, ZSIsik, SUçar, GBilgin, AA Synthesis and molecular modeling of some novel hexahydroindazole derivatives as potent monoamine oxidase inhibitors. Bioorg Med Chem17:6761-72 (2009) 
 
Amine oxidase [flavin-containing] A
Name:Amine oxidase [flavin-containing] A
Type:Enzyme
Mol. Mass.:59515.21
Organism:Rattus norvegicus (rat)
Description:n/a
Residue:526
BDBM50304152
NameBDBM50304152
Synonyms:3-(2-Furyl)-2-thiocarbamoyl-2,3,4,5,6,7-hexahydro-1Hindazol | CHEMBL596453
TypeSmall organic molecule
Emp. Form.C12H15N3OS
Mol. Mass.249.332
SMILESNC(=S)N1N=C2CCCCC2C1c1ccco1