Reaction Details
TargetAmine oxidase [flavin-containing] B
LigandBDBM50304157
Substrate/Competitorn/a
Meas. Tech.ChEMBL_601026 (CHEMBL1069163)
IC50 1260±n/a nM
Citation Gökhan-Kelekçi, NSimsek, OOErcan, AYelekçi, KSahin, ZSIsik, SUçar, GBilgin, AA Synthesis and molecular modeling of some novel hexahydroindazole derivatives as potent monoamine oxidase inhibitors. Bioorg Med Chem17:6761-72 (2009) 
 
Amine oxidase [flavin-containing] B
Name:Amine oxidase [flavin-containing] B
Type:Enzyme
Mol. Mass.:58469.65
Organism:Rattus norvegicus (rat)
Description:P19643
Residue:520
BDBM50304157
NameBDBM50304157
Synonyms:3-(2-Thienyl)-2-thiocarbamoyl-2,3,4,5,6,7-hexahydro-1Hindazol | CHEMBL592976
TypeSmall organic molecule
Emp. Form.C12H15N3S2
Mol. Mass.265.398
SMILESNC(=S)N1N=C2CCCCC2C1c1cccs1