Reaction Details
TargetAmine oxidase [flavin-containing] B
LigandBDBM15579
Substrate/Competitorn/a
Meas. Tech.ChEMBL_601026 (CHEMBL1069163)
IC50 1600±n/a nM
Citation Gökhan-Kelekçi, NSimsek, OOErcan, AYelekçi, KSahin, ZSIsik, SUçar, GBilgin, AA Synthesis and molecular modeling of some novel hexahydroindazole derivatives as potent monoamine oxidase inhibitors. Bioorg Med Chem17:6761-72 (2009) 
 
Amine oxidase [flavin-containing] B
Name:Amine oxidase [flavin-containing] B
Type:Enzyme
Mol. Mass.:58469.65
Organism:Rattus norvegicus (rat)
Description:P19643
Residue:520
BDBM15579
NameBDBM15579
Synonyms:CHEMBL972 L-Deprenyl SLG US8633208, Deprenyl methyl[(2R)-1-phenylpropan-2-yl]prop-2-yn-1-ylamine
TypeSmall organic molecule
Emp. Form.C13H17N
Mol. Mass.187.2808
SMILESC[C@H](Cc1ccccc1)N(C)CC#C