Reaction Details
TargetAmine oxidase [flavin-containing] B
LigandBDBM50304161
Substrate/Competitorn/a
Meas. Tech.ChEMBL_601026 (CHEMBL1069163)
Ki 92260±n/a nM
Citation Gökhan-Kelekçi, NSimsek, OOErcan, AYelekçi, KSahin, ZSIsik, SUçar, GBilgin, AA Synthesis and molecular modeling of some novel hexahydroindazole derivatives as potent monoamine oxidase inhibitors. Bioorg Med Chem17:6761-72 (2009) 
 
Amine oxidase [flavin-containing] B
Name:Amine oxidase [flavin-containing] B
Type:Enzyme
Mol. Mass.:58469.65
Organism:Rattus norvegicus (rat)
Description:P19643
Residue:520
BDBM50304161
NameBDBM50304161
Synonyms:3-(2-Thienyl)-2-(N-phenylthiocarbamoyl)-3,3a,4,5,6,7-hexahydro-2H-indazol | CHEMBL593341
TypeSmall organic molecule
Emp. Form.C18H19N3S2
Mol. Mass.341.494
SMILESS=C(Nc1ccccc1)N1N=C2CCCCC2C1c1cccs1