Reaction Details
TargetAurora kinase B
LigandBDBM50304198
Substrate/Competitorn/a
Meas. Tech.ChEMBL_605383 (CHEMBL1073377)
IC50 78±n/a nM
Citation Tasler, SMüller, OWieber, THerz, TPegoraro, SSaeb, WLang, MKrauss, RTotzke, FZirrgiebel, UEhlert, JEKubbutat, MHSchächtele, C Substituted 2-arylbenzothiazoles as kinase inhibitors: hit-to-lead optimization. Bioorg Med Chem17:6728-37 (2009) 
 
Aurora kinase B
Name:Aurora kinase B
Type:Protein
Mol. Mass.:39327.72
Organism:Homo sapiens (Human)
Description:Q96GD4
Residue:344
BDBM50304198
NameBDBM50304198
Synonyms:CHEMBL593274 | N-(4-(benzo[d]thiazol-2-yl)-3-chlorophenyl)-6-methoxy-7-(3-(4-methylpiperazin-1-yl)propoxy)quinazolin-4-amine
TypeSmall organic molecule
Emp. Form.C30H31ClN6O2S
Mol. Mass.575.124
SMILESCOc1cc2c(Nc3ccc(-c4nc5ccccc5s4)c(Cl)c3)ncnc2cc1OCCCN1CCN(C)CC1