Reaction Details
TargetReceptor tyrosine-protein kinase erbB-2
LigandBDBM50304198
Substrate/Competitorn/a
Meas. Tech.ChEMBL_605387 (CHEMBL1073381)
IC50 38±n/a nM
Citation Tasler, SMüller, OWieber, THerz, TPegoraro, SSaeb, WLang, MKrauss, RTotzke, FZirrgiebel, UEhlert, JEKubbutat, MHSchächtele, C Substituted 2-arylbenzothiazoles as kinase inhibitors: hit-to-lead optimization. Bioorg Med Chem17:6728-37 (2009) 
 
Receptor tyrosine-protein kinase erbB-2
Name:Receptor tyrosine-protein kinase erbB-2
Type:n/a
Mol. Mass.:137894.47
Organism:Homo sapiens (Human)
Description:P04626
Residue:1255
BDBM50304198
NameBDBM50304198
Synonyms:CHEMBL593274 | N-(4-(benzo[d]thiazol-2-yl)-3-chlorophenyl)-6-methoxy-7-(3-(4-methylpiperazin-1-yl)propoxy)quinazolin-4-amine
TypeSmall organic molecule
Emp. Form.C30H31ClN6O2S
Mol. Mass.575.124
SMILESCOc1cc2c(Nc3ccc(-c4nc5ccccc5s4)c(Cl)c3)ncnc2cc1OCCCN1CCN(C)CC1