Reaction Details
TargetAurora kinase A
LigandBDBM50304203
Substrate/Competitorn/a
Meas. Tech.ChEMBL_605382 (CHEMBL1073376)
IC50 82±n/a nM
Citation Tasler, SMüller, OWieber, THerz, TPegoraro, SSaeb, WLang, MKrauss, RTotzke, FZirrgiebel, UEhlert, JEKubbutat, MHSchächtele, C Substituted 2-arylbenzothiazoles as kinase inhibitors: hit-to-lead optimization. Bioorg Med Chem17:6728-37 (2009) 
 
Aurora kinase A
Name:Aurora kinase A
Type:Serine/threonine-protein kinase
Mol. Mass.:45830.98
Organism:Homo sapiens (Human)
Description:O14965
Residue:403
BDBM50304203
NameBDBM50304203
Synonyms:2-(4-(6-methoxy-7-(3-(4-methylpiperazin-1-yl)propoxy)quinazolin-4-yloxy)phenyl)benzo[d]thiazole | CHEMBL595143
TypeSmall organic molecule
Emp. Form.C30H31N5O3S
Mol. Mass.541.664
SMILESCOc1cc2c(Oc3ccc(cc3)-c3nc4ccccc4s3)ncnc2cc1OCCCN1CCN(C)CC1