Reaction Details
TargetSodium- and chloride-dependent GABA transporter 1
LigandBDBM50304266
Substrate/Competitorn/a
Meas. Tech.ChEMBL_605767 (CHEMBL1073263)
IC50 400±n/a nM
Citation Zhuang, WZhao, XZhao, GGuo, LLian, YZhou, JFang, D Synthesis and biological evaluation of 4-fluoroproline and 4-fluoropyrrolidine-2-acetic acid derivatives as new GABA uptake inhibitors. Bioorg Med Chem17:6540-6 (2009) 
 
Sodium- and chloride-dependent GABA transporter 1
Name:Sodium- and chloride-dependent GABA transporter 1
Type:PROTEIN
Mol. Mass.:67006.26
Organism:Mus musculus
Description:ChEMBL_788602
Residue:599
BDBM50304266
NameBDBM50304266
Synonyms:(S)-2-(1-(4,4-diphenylbut-3-enyl)pyrrolidin-2-yl)acetic acid | CHEMBL594213
TypeSmall organic molecule
Emp. Form.C22H25NO2
Mol. Mass.335.4394
SMILES[#8]-[#6](=O)-[#6]-[#6@@H]-1-[#6]-[#6]-[#6]-[#7]-1-[#6]-[#6]\[#6]=[#6](\c1ccccc1)-c1ccccc1