Reaction Details
TargetSeed linoleate 13S-lipoxygenase-1
LigandBDBM50304295
Substrate/Competitorn/a
Meas. Tech.ChEMBL_606153 (CHEMBL1074619)
Ki 140000±n/a nM
Citation Wecksler, ATGarcia, NKHolman, TR Substrate specificity effects of lipoxygenase products and inhibitors on soybean lipoxygenase-1. Bioorg Med Chem17:6534-9 (2009) 
 
Seed linoleate 13S-lipoxygenase-1
Name:Seed linoleate 13S-lipoxygenase-1
Type:Enzyme
Mol. Mass.:94365.66
Organism:Glycine max (soybean)
Description:n/a
Residue:839
BDBM50304295
NameBDBM50304295
Synonyms:CHEMBL611951 | Palmitoleyl sulfate
TypeSmall organic molecule
Emp. Form.C16H32O4S
Mol. Mass.320.488
SMILESCCCCCCCC\C=C/CCCCCCOS(O)(=O)=O