Reaction Details
TargetGlycine receptor subunit alpha-1
LigandBDBM50304335
Substrate/Competitorn/a
Meas. Tech.ChEMBL_606509 (CHEMBL1065460)
IC50 125.89±n/a nM
Citation Maksay, GVincze, ZNemes, P Synthesis of heteroaromatic tropeines and heterogeneous binding to glycine receptors. Bioorg Med Chem17:6872-8 (2009) 
 
Glycine receptor subunit alpha-1
Name:Glycine receptor subunit alpha-1
Type:Enzyme Catalytic Domain
Mol. Mass.:52629.37
Organism:RAT
Description:Glycine, non-strychnine 0 RAT::P07727
Residue:457
BDBM50304335
NameBDBM50304335
Synonyms:3alpha-(1'-Methyl-2'-Indolecarbonyloxy)-nortropane | CHEMBL608710
TypeSmall organic molecule
Emp. Form.C17H20N2O2
Mol. Mass.284.3529
SMILESCn1c(cc2ccccc12)C(=O)OC1C[C@H]2CC[C@H](C1)N2