Reaction Details
TargetHexokinase-4
LigandBDBM50304377
Substrate/Competitorn/a
Meas. Tech.ChEMBL_602874 (CHEMBL1038417)
EC50 20±n/a nM
Citation Takahashi, KHashimoto, NNakama, CKamata, KSasaki, KYoshimoto, ROhyama, SHosaka, HMaruki, HNagata, YEiki, JNishimura, T The design and optimization of a series of 2-(pyridin-2-yl)-1H-benzimidazole compounds as allosteric glucokinase activators. Bioorg Med Chem17:7042-51 (2009) 
 
Hexokinase-4
Name:Hexokinase-4
Type:Enzyme
Mol. Mass.:52175.81
Organism:Homo sapiens (Human)
Description:P35557
Residue:465
BDBM50304377
NameBDBM50304377
Synonyms:3-({5-[4-(Ethylsulfonyl)phenoxy]-2-(pyridin-2-yl)-1Hbenzimidazol-6-yl}methyl)-1,3-oxazolidine-2,4-dione | CHEMBL596026
TypeSmall organic molecule
Emp. Form.C24H20N4O6S
Mol. Mass.492.504
SMILESCCS(=O)(=O)c1ccc(Oc2cc3[nH]c(nc3cc2Cn2c(O)coc2=O)-c2ccccn2)cc1