Reaction Details
TargetSubstance-P receptor
LigandBDBM50304489
Substrate/Competitorn/a
Meas. Tech.ChEMBL_603836 (CHEMBL1045631)
IC50 0.489779±n/a nM
Citation Yamamoto, TNair, PMa, SWDavis, PYamamura, HIVanderah, TWPorreca, FLai, JHruby, VJ The biological activity and metabolic stability of peptidic bifunctional compounds that are opioid receptor agonists and neurokinin-1 receptor antagonists with a cystine moiety. Bioorg Med Chem17:7337-43 (2009) 
 
Substance-P receptor
Name:Substance-P receptor
Type:G Protein-Coupled Receptor (GPCR)
Mol. Mass.:46254.43
Organism:Homo sapiens (Human)
Description:P25103
Residue:407
BDBM50304489
NameBDBM50304489
Synonyms:CHEMBL592969 | H-Tyr-c[D-Cys-Gly-Phe-Nle-Pro-D-Cys]-Trp-NH-[3',5'-(CF3)2Bzl]
TypeSmall organic molecule
Emp. Form.C57H64F6N10O9S2
Mol. Mass.1211.3
SMILESCCCC[C@@H]1NC(=O)[C@H](Cc2ccccc2)NC(=O)CNC(=O)[C@@H](CSSC[C@@H](NC(=O)[C@@H]2CCCN2C1=O)C(=O)N[C@@H](Cc1c[nH]c2ccccc12)C(=O)NCc1cc(cc(c1)C(F)(F)F)C(F)(F)F)NC(=O)[C@@H](N)Cc1ccc(O)cc1