Reaction Details
TargetHistamine H4 receptor
LigandBDBM50304501
Substrate/Competitorn/a
Meas. Tech.ChEMBL_603902 (CHEMBL1048581)
Ki 290±n/a nM
Citation Sander, KKottke, TTanrikulu, YProschak, EWeizel, LSchneider, EHSeifert, RSchneider, GStark, H 2,4-Diaminopyrimidines as histamine H4 receptor ligands--Scaffold optimization and pharmacological characterization. Bioorg Med Chem17:7186-96 (2009) 
 
Histamine H4 receptor
Name:Histamine H4 receptor
Type:G Protein-Coupled Receptor (GPCR)
Mol. Mass.:44517.02
Organism:Homo sapiens (Human)
Description:Binding assays were using CHO cells stably expressing hH4R receptors.
Residue:390
BDBM50304501
NameBDBM50304501
Synonyms:6-(4-Methylpiperazin-1-yl)pyrimidine-2,4-diamine | CHEMBL473662
TypeSmall organic molecule
Emp. Form.C9H16N6
Mol. Mass.208.2635
SMILESCN1CCN(CC1)c1cc(N)nc(N)n1