Reaction Details
TargetHistamine H4 receptor
LigandBDBM50304516
Substrate/Competitorn/a
Meas. Tech.ChEMBL_603902 (CHEMBL1048581)
Ki 35000±n/a nM
Citation Sander, KKottke, TTanrikulu, YProschak, EWeizel, LSchneider, EHSeifert, RSchneider, GStark, H 2,4-Diaminopyrimidines as histamine H4 receptor ligands--Scaffold optimization and pharmacological characterization. Bioorg Med Chem17:7186-96 (2009) 
 
Histamine H4 receptor
Name:Histamine H4 receptor
Type:G Protein-Coupled Receptor (GPCR)
Mol. Mass.:44517.02
Organism:Homo sapiens (Human)
Description:Binding assays were using CHO cells stably expressing hH4R receptors.
Residue:390
BDBM50304516
NameBDBM50304516
Synonyms:1-((1-Benzyl-1H-1,2,3-triazol-4-yl)methyl)-4-methylpiperazine | CHEMBL593448
TypeSmall organic molecule
Emp. Form.C15H21N5
Mol. Mass.271.3607
SMILESCN1CCN(Cc2cn(Cc3ccccc3)nn2)CC1