Reaction Details
TargetHistamine H1 receptor
LigandBDBM50304523
Substrate/Competitorn/a
Meas. Tech.ChEMBL_604062 (CHEMBL1046851)
Ki>1000±n/a nM
Citation Sander, KKottke, TTanrikulu, YProschak, EWeizel, LSchneider, EHSeifert, RSchneider, GStark, H 2,4-Diaminopyrimidines as histamine H4 receptor ligands--Scaffold optimization and pharmacological characterization. Bioorg Med Chem17:7186-96 (2009) 
 
Histamine H1 receptor
Name:Histamine H1 receptor
Type:G Protein-Coupled Receptor (GPCR)
Mol. Mass.:55808.72
Organism:Homo sapiens (Human)
Description:Cell pellets from SK-N-MC cells transfected with human H1 receptor were used in binding assay.
Residue:487
BDBM50304523
NameBDBM50304523
Synonyms:CHEMBL595180 | N4-(2,6-Dichlorobenzyl)-6-(4-methylpiperazin-1-yl)pyrimidine-2,4-diamine
TypeSmall organic molecule
Emp. Form.C16H20Cl2N6
Mol. Mass.367.276
SMILESCN1CCN(CC1)c1cc(NCc2c(Cl)cccc2Cl)nc(N)n1