Reaction Details
TargetLysophosphatidic acid receptor 5
LigandBDBM50304580
Substrate/Competitorn/a
Meas. Tech.ChEMBL_605123 (CHEMBL1064666)
IC50 463±n/a nM
Citation Fells, JITsukahara, RLiu, JTigyi, GParrill, AL Structure-based drug design identifies novel LPA3 antagonists. Bioorg Med Chem17:7457-64 (2009) 
 
Lysophosphatidic acid receptor 5
Name:Lysophosphatidic acid receptor 5
Type:Enzyme
Mol. Mass.:41372.36
Organism:Homo sapiens (Human)
Description:Q9H1C0
Residue:372
BDBM50304580
NameBDBM50304580
Synonyms:2-(3-(4-nitrophenoxy)phenyl)-1,3-dioxoisoindoline-5-carboxylic acid | CHEMBL604677
TypeSmall organic molecule
Emp. Form.C21H12N2O7
Mol. Mass.404.3292
SMILESOC(=O)c1ccc2C(=O)N(C(=O)c2c1)c1cccc(Oc2ccc(cc2)[N+]([O-])=O)c1