Reaction Details
TargetLysophosphatidic acid receptor 1
LigandBDBM50304581
Substrate/Competitorn/a
Meas. Tech.ChEMBL_605119 (CHEMBL1073933)
IC50 609±n/a nM
Citation Fells, JITsukahara, RLiu, JTigyi, GParrill, AL Structure-based drug design identifies novel LPA3 antagonists. Bioorg Med Chem17:7457-64 (2009) 
 
Lysophosphatidic acid receptor 1
Name:Lysophosphatidic acid receptor 1
Type:Enzyme
Mol. Mass.:41120.55
Organism:Homo sapiens (Human)
Description:Q92633
Residue:364
BDBM50304581
NameBDBM50304581
Synonyms:2-(1,3-dioxo-5-(p-tolyloxy)isoindolin-2-yl)acetic acid | CHEMBL607806
TypeSmall organic molecule
Emp. Form.C17H13NO5
Mol. Mass.311.2888
SMILESCc1ccc(Oc2ccc3C(=O)N(CC(O)=O)C(=O)c3c2)cc1