Reaction Details
TargetLysophosphatidic acid receptor 3
LigandBDBM50271701
Substrate/Competitorn/a
Meas. Tech.ChEMBL_605121 (CHEMBL1073935)
IC50 30±n/a nM
Citation Fells, JITsukahara, RLiu, JTigyi, GParrill, AL Structure-based drug design identifies novel LPA3 antagonists. Bioorg Med Chem17:7457-64 (2009) 
 
Lysophosphatidic acid receptor 3
Name:Lysophosphatidic acid receptor 3
Type:Enzyme
Mol. Mass.:40149.72
Organism:Homo sapiens (Human)
Description:Q9UBY5
Residue:353
BDBM50271701
NameBDBM50271701
Synonyms:2,6-bis(3-carboxyacrylamido)benzoic acid CHEMBL485119
TypeSmall organic molecule
Emp. Form.C15H12N2O8
Mol. Mass.348.2644
SMILESOC(=O)\C=C\C(=O)Nc1cccc(NC(=O)\C=C\C(O)=O)c1C(O)=O