Reaction Details
TargetLysophosphatidic acid receptor 1
LigandBDBM50271763
Substrate/Competitorn/a
Meas. Tech.ChEMBL_605119 (CHEMBL1073933)
IC50 220±n/a nM
Citation Fells, JITsukahara, RLiu, JTigyi, GParrill, AL Structure-based drug design identifies novel LPA3 antagonists. Bioorg Med Chem17:7457-64 (2009) 
 
Lysophosphatidic acid receptor 1
Name:Lysophosphatidic acid receptor 1
Type:Enzyme
Mol. Mass.:41120.55
Organism:Homo sapiens (Human)
Description:Q92633
Residue:364
BDBM50271763
NameBDBM50271763
Synonyms:3-[3-(3-Carboxy-acryloylamino)-phenylcarbamoyl]-acrylic acid CHEMBL519002
TypeSmall organic molecule
Emp. Form.C14H12N2O6
Mol. Mass.304.2549
SMILESOC(=O)\C=C\C(=O)Nc1cccc(NC(=O)\C=C\C(O)=O)c1