Reaction Details
TargetVitamin D3 receptor
LigandBDBM50304583
Substrate/Competitorn/a
Meas. Tech.ChEMBL_606218 (CHEMBL1067951)
Ki 0.1±n/a nM
Citation Barycki, RSicinski, RRPlum, LAGrzywacz, PClagett-Dame, MDeluca, HF Removal of the 20-methyl group from 2-methylene-19-nor-(20S)-1alpha,25-dihydroxyvitamin D(3) (2MD) selectively eliminates bone calcium mobilization activity. Bioorg Med Chem17:7658-69 (2009) 
 
Vitamin D3 receptor
Name:Vitamin D3 receptor
Type:PROTEIN
Mol. Mass.:47811.07
Organism:Rattus norvegicus
Description:ChEMBL_1505946
Residue:423
BDBM50304583
NameBDBM50304583
Synonyms:1alpha,25-Dihydroxy-2-methylene-18,19,21-trinorvitamin D3 | CHEMBL594078
TypeSmall organic molecule
Emp. Form.C25H40O3
Mol. Mass.388.5833
SMILES[#6]C([#6])([#8])[#6]-[#6]-[#6]-[#6]-[#6@H]-1-[#6]-[#6]-[#6@@H]2-[#6@@H]-1-[#6]-[#6]-[#6]\[#6]-2=[#6]/[#6]=[#6]-1/[#6]-[#6@@H](-[#8])-[#6](=[#6])-[#6@H](-[#8])-[#6]-1