Reaction Details
TargetTissue alpha-L-fucosidase
LigandBDBM50304628
Substrate/Competitorn/a
Meas. Tech.ChEMBL_604167 (CHEMBL1039761)
Ki 10±n/a nM
Citation Pearson, MSFloquet, NBello, CVogel, PPlantier-Royon, RSzymoniak, JBertus, PBehr, JB The spirocyclopropyl moiety as a methyl surrogate in the structure of l-fucosidase and l-rhamnosidase inhibitors. Bioorg Med Chem17:8020-6 (2009) 
 
Tissue alpha-L-fucosidase
Name:Tissue alpha-L-fucosidase
Type:PROTEIN
Mol. Mass.:54093.12
Organism:Bos taurus
Description:ChEMBL_335897
Residue:468
BDBM50304628
NameBDBM50304628
Synonyms:(2S,3R,4S)-2-methyl-3,4-dihydro-2H-pyrrole-3,4-diol | CHEMBL593679
TypeSmall organic molecule
Emp. Form.C5H9NO2
Mol. Mass.115.1305
SMILESC[C@@H]1NC[C@H](O)C1=O