Reaction Details
TargetAdenosine receptor A3
LigandBDBM50304630
Substrate/Competitorn/a
Meas. Tech.ChEMBL_604437 (CHEMBL1070693)
Ki 1.04±n/a nM
Citation Choi, WJLee, HWKim, HOChinn, MGao, ZGPatel, AJacobson, KAMoon, HRJung, YHJeong, LS Design and synthesis of N(6)-substituted-4'-thioadenosine-5'-uronamides as potent and selective human A(3) adenosine receptor agonists. Bioorg Med Chem17:8003-11 (2009) 
 
Adenosine receptor A3
Name:Adenosine receptor A3
Type:G Protein-Coupled Receptor (GPCR)
Mol. Mass.:36197.32
Organism:Homo sapiens (Human)
Description:P0DMS8
Residue:318
BDBM50304630
NameBDBM50304630
Synonyms:9-(5'-Cyclobutylaminocarbonyl-4'-thio-beta-D-ribofuranosyl)-N6-methyladenine | CHEMBL606630
TypeSmall organic molecule
Emp. Form.C15H20N6O3S
Mol. Mass.364.423
SMILESCNc1ncnc2n(cnc12)[C@@H]1S[C@@H]([C@@H](O)[C@H]1O)C(=O)NC1CCC1