Reaction Details
TargetAdenosine receptor A3
LigandBDBM50304637
Substrate/Competitorn/a
Meas. Tech.ChEMBL_604437 (CHEMBL1070693)
Ki 3.03±n/a nM
Citation Choi, WJLee, HWKim, HOChinn, MGao, ZGPatel, AJacobson, KAMoon, HRJung, YHJeong, LS Design and synthesis of N(6)-substituted-4'-thioadenosine-5'-uronamides as potent and selective human A(3) adenosine receptor agonists. Bioorg Med Chem17:8003-11 (2009) 
 
Adenosine receptor A3
Name:Adenosine receptor A3
Type:G Protein-Coupled Receptor (GPCR)
Mol. Mass.:36197.32
Organism:Homo sapiens (Human)
Description:P0DMS8
Residue:318
BDBM50304637
NameBDBM50304637
Synonyms:9-(5'-Cyclopropylaminocarbonyl-4'-thio-beta-D-ribofuranosyl)-N6-(3-iodo-benzyl)adenine | CHEMBL596014
TypeSmall organic molecule
Emp. Form.C20H21IN6O3S
Mol. Mass.552.389
SMILESO[C@H]1[C@@H](O)[C@@H](S[C@@H]1C(=O)NC1CC1)n1cnc2c(NCc3cccc(I)c3)ncnc12