Reaction Details
TargetAdenosine receptor A1
LigandBDBM50304635
Substrate/Competitorn/a
Meas. Tech.ChEMBL_604433 (CHEMBL1070689)
Ki 5.4±n/a nM
Citation Choi, WJLee, HWKim, HOChinn, MGao, ZGPatel, AJacobson, KAMoon, HRJung, YHJeong, LS Design and synthesis of N(6)-substituted-4'-thioadenosine-5'-uronamides as potent and selective human A(3) adenosine receptor agonists. Bioorg Med Chem17:8003-11 (2009) 
 
Adenosine receptor A1
Name:Adenosine receptor A1
Type:G Protein-Coupled Receptor (GPCR)
Mol. Mass.:36520.92
Organism:Homo sapiens (Human)
Description:P30542
Residue:326
BDBM50304635
NameBDBM50304635
Synonyms:9-(5'-Ethylaminocarbonyl-4-thio-beta-D-ribofuranosyl)-N6-(3-iodo-benzyl)adenine | CHEMBL596042
TypeSmall organic molecule
Emp. Form.C19H21IN6O3S
Mol. Mass.540.378
SMILESCCNC(=O)[C@H]1S[C@H]([C@H](O)[C@@H]1O)n1cnc2c(NCc3cccc(I)c3)ncnc12