Reaction Details
TargetProstaglandin E synthase
LigandBDBM31125
Substrate/Competitorn/a
Meas. Tech.ChEMBL_604678 (CHEMBL1068501)
IC50 500±n/a nM
Citation Koeberle, AHaberl, EMRossi, APergola, CDehm, FNorthoff, HTroschuetz, RSautebin, LWerz, O Discovery of benzo[g]indol-3-carboxylates as potent inhibitors of microsomal prostaglandin E(2) synthase-1. Bioorg Med Chem17:7924-32 (2009) 
 
Prostaglandin E synthase
Name:Prostaglandin E synthase
Type:Protein
Mol. Mass.:17112.22
Organism:Homo sapiens (Human)
Description:n/a
Residue:152
BDBM31125
NameBDBM31125
Synonyms:5-hydroxy-1H-benzo[g]indole-3-carboxylate, 11d
TypeSmall organic molecule
Emp. Form.C22H18FNO3
Mol. Mass.363.3816
SMILESCCOC(=O)c1c(Cc2cccc(F)c2)[nH]c2c1cc(O)c1ccccc21